Hi!!
I've a pproblem, when I exe "make" for ser, The module mysql don't make
and don't install. And if I try "make modules=modules/mysql modules" I
have a lot of errors that are in the file.
Somebody help me!
--
Sandra Donaire Arroyo
Telefónica I+D
División de "Tecnologías de acceso a redes IP"
ero incluído de val.c:35:
val.h:31:25: mysql/mysql.h: No existe el fichero o el directorio
row.c:33:25: mysql/mysql.h: No existe el fichero o el directorio
res.c:31:25: mysql/mysql.h: No existe el fichero o el directorio
En el fichero incluído de my_pool.h:32,
de my_pool.c:31:
my_con.h:33:25: mysql/mysql.h: No existe el fichero o el directorio
En el fichero incluído de my_con.c:31:
my_con.h:33:25: mysql/mysql.h: No existe el fichero o el directorio
dbase.c:34:25: mysql/mysql.h: No existe el fichero o el directorio
dbase.c:35:26: mysql/errmsg.h: No existe el fichero o el directorio
dbase.c:34:25: mysql/mysql.h: No existe el fichero o el directorio
dbase.c:35:26: mysql/errmsg.h: No existe el fichero o el directorio
In file included from dbase.c:39:
val.h:44: error: error sintáctico antes del elemento '*'
In file included from dbase.c:40:
my_con.h:39: error: error sintáctico antes de "MYSQL_RES"
my_con.h:39: aviso: no hay punto y coma al final del struct o union
my_con.h:40: aviso: el tipo de dato por defecto es `int' en la declaración de
`con'
my_con.h:40: aviso: la definición de datos no tiene tipo o clase de
almacenamiento
my_con.h:41: error: error sintáctico antes de "row"
my_con.h:41: aviso: el tipo de dato por defecto es `int' en la declaración de
`row'
my_con.h:41: aviso: la definición de datos no tiene tipo o clase de
almacenamiento
my_con.h:44: error: error sintáctico antes del elemento '}'
dbase.c: In function `submit_query':
dbase.c:67: error: puntero deferenciado a tipo de dato incompleto
dbase.c:68: aviso: declaración implícita de la función `mysql_ping'
dbase.c:68: error: puntero deferenciado a tipo de dato incompleto
dbase.c:72: error: puntero deferenciado a tipo de dato incompleto
dbase.c:90: aviso: declaración implícita de la función `mysql_query'
dbase.c:90: error: puntero deferenciado a tipo de dato incompleto
dbase.c:93: aviso: declaración implícita de la función `mysql_errno'
dbase.c:93: error: puntero deferenciado a tipo de dato incompleto
dbase.c:94: error: `CR_SERVER_GONE_ERROR' no se declaró aquí (primer uso en
esta función)
dbase.c:94: error: (Cada identificador no declarado solamente se reporta una
vez
dbase.c:94: error: para cada funcion en la que aparece.)
dbase.c:94: error: `CR_SERVER_LOST' no se declaró aquí (primer uso en esta
función)
dbase.c:98: aviso: declaración implícita de la función `mysql_error'
dbase.c:98: error: puntero deferenciado a tipo de dato incompleto
dbase.c:98: error: puntero deferenciado a tipo de dato incompleto
dbase.c:98: aviso: el argumento de formato no es un puntero (argumento 3)
dbase.c:98: error: puntero deferenciado a tipo de dato incompleto
dbase.c:98: aviso: el argumento de formato no es un puntero (argumento 3)
dbase.c:98: error: puntero deferenciado a tipo de dato incompleto
dbase.c:98: aviso: el argumento de formato no es un puntero (argumento 3)
dbase.c:98: error: puntero deferenciado a tipo de dato incompleto
dbase.c:98: aviso: el argumento de formato no es un puntero (argumento 3)
dbase.c:98: error: puntero deferenciado a tipo de dato incompleto
dbase.c:98: aviso: el argumento de formato no es un puntero (argumento 3)
dbase.c:98: error: puntero deferenciado a tipo de dato incompleto
dbase.c:98: aviso: el argumento de formato no es un puntero (argumento 3)
dbase.c:98: error: puntero deferenciado a tipo de dato incompleto
dbase.c:98: aviso: el argumento de formato no es un puntero (argumento 3)
dbase.c: At top level:
dbase.c:138: error: error sintáctico antes del elemento '*'
dbase.c: In function `print_values':
dbase.c:142: error: `_c' no se declaró aquí (primer uso en esta función)
dbase.c:142: error: `_b' no se declaró aquí (primer uso en esta función)
dbase.c:142: error: `_l' no se declaró aquí (primer uso en esta función)
dbase.c:142: error: `_v' no se declaró aquí (primer uso en esta función)
dbase.c:142: error: `_n' no se declaró aquí (primer uso en esta función)
dbase.c: At top level:
dbase.c:166: error: error sintáctico antes del elemento '*'
dbase.c: In function `print_where':
dbase.c:172: error: `_c' no se declaró aquí (primer uso en esta función)
dbase.c:172: error: `_b' no se declaró aquí (primer uso en esta función)
dbase.c:172: error: `_l' no se declaró aquí (primer uso en esta función)
dbase.c:172: error: `_k' no se declaró aquí (primer uso en esta función)
dbase.c:172: error: `_v' no se declaró aquí (primer uso en esta función)
dbase.c:172: error: `_n' no se declaró aquí (primer uso en esta función)
dbase.c:178: error: `_o' no se declaró aquí (primer uso en esta función)
dbase.c: At top level:
dbase.c:207: error: error sintáctico antes del elemento '*'
dbase.c: In function `print_set':
dbase.c:213: error: `_c' no se declaró aquí (primer uso en esta función)
dbase.c:213: error: `_b' no se declaró aquí (primer uso en esta función)
dbase.c:213: error: `_l' no se declaró aquí (primer uso en esta función)
dbase.c:213: error: `_k' no se declaró aquí (primer uso en esta función)
dbase.c:213: error: `_v' no se declaró aquí (primer uso en esta función)
dbase.c:213: error: `_n' no se declaró aquí (primer uso en esta función)
dbase.c: In function `store_result':
dbase.c:304: error: puntero deferenciado a tipo de dato incompleto
dbase.c:304: aviso: declaración implícita de la función `mysql_store_result'
dbase.c:304: error: puntero deferenciado a tipo de dato incompleto
dbase.c:305: error: puntero deferenciado a tipo de dato incompleto
dbase.c:306: aviso: declaración implícita de la función `mysql_field_count'
dbase.c:306: error: puntero deferenciado a tipo de dato incompleto
dbase.c:311: error: puntero deferenciado a tipo de dato incompleto
dbase.c:311: error: puntero deferenciado a tipo de dato incompleto
dbase.c:311: aviso: el argumento de formato no es un puntero (argumento 3)
dbase.c:311: error: puntero deferenciado a tipo de dato incompleto
dbase.c:311: aviso: el argumento de formato no es un puntero (argumento 3)
dbase.c:311: error: puntero deferenciado a tipo de dato incompleto
dbase.c:311: aviso: el argumento de formato no es un puntero (argumento 3)
dbase.c:311: error: puntero deferenciado a tipo de dato incompleto
dbase.c:311: aviso: el argumento de formato no es un puntero (argumento 3)
dbase.c:311: error: puntero deferenciado a tipo de dato incompleto
dbase.c:311: aviso: el argumento de formato no es un puntero (argumento 3)
dbase.c:311: error: puntero deferenciado a tipo de dato incompleto
dbase.c:311: aviso: el argumento de formato no es un puntero (argumento 3)
dbase.c:311: error: puntero deferenciado a tipo de dato incompleto
dbase.c:311: aviso: el argumento de formato no es un puntero (argumento 3)
dbase.c: In function `db_free_result':
dbase.c:348: aviso: declaración implícita de la función `mysql_free_result'
dbase.c:348: error: puntero deferenciado a tipo de dato incompleto
dbase.c:349: error: puntero deferenciado a tipo de dato incompleto
dbase.c: In function `db_query':
dbase.c:398: error: puntero deferenciado a tipo de dato incompleto
dbase.c: In function `db_insert':
dbase.c:471: error: puntero deferenciado a tipo de dato incompleto
dbase.c: In function `db_delete':
dbase.c:516: error: puntero deferenciado a tipo de dato incompleto
dbase.c: In function `db_update':
dbase.c:559: error: puntero deferenciado a tipo de dato incompleto
dbase.c:568: error: puntero deferenciado a tipo de dato incompleto
make[1]: *** [dbase.o] Error 1
[root@leia ser-0.9.3]# vi error.txt